Как установить self.maxDiff в носу, чтобы получить полный выход diff?
при использовании nose 1.2.1 с Python 3.3.0 я иногда получаю сообщение об ошибке, подобное следующему
======================================================================
FAIL: maxdiff2.test_equal
----------------------------------------------------------------------
Traceback (most recent call last):
File "/usr/local/lib/python3.3/site-packages/nose/case.py", line 198, in runTest
self.test(*self.arg)
File "/Users/loic/cmrsj/Calculus_II/scrap/maxdiff2.py", line 32, in test_equal
assert_equal(str1, str2)
AssertionError: 'Lorem ipsum dolor sit amet, consectetur adipiscing elit. Donec a
diam lectus.n [truncated]... != 'Suspendisse lectus leo, consectetur in tempor sit
amet, placerat quis neque.nE [truncated]...
Diff is 1780 characters long. Set self.maxDiff to None to see it.
----------------------------------------------------------------------
Ran 1 test in 0.064s
FAILED (failures=1)
во многих ситуациях, чтобы выяснить, что ошибка на самом деле, мне нужно увидеть полный вывод diff. Однако я понятия не имею, как установить это self.maxDiff
. Googling для носа и maxDiff не помогает. С той же версией nose на Python 2.7.1 полный diff печатается на экран.
вот простой скрипт, который генерирует ошибку выше, когда беги с nosetests-3.3
:
from nose.tools import assert_equal
def test_equal():
str1 = """
Lorem ipsum dolor sit amet, consectetur adipiscing elit. Donec a diam lectus.
Sed sit amet ipsum mauris. Maecenas congue ligula ac quam viverra nec
consectetur ante hendrerit. Donec et mollis dolor. Praesent et diam eget libero
egestas mattis sit amet vitae augue. Nam tincidunt congue enim, ut porta lorem
lacinia consectetur. Donec ut libero sed arcu vehicula ultricies a non tortor.
Lorem ipsum dolor sit amet, consectetur adipiscing elit. Aenean ut gravida
lorem. Ut turpis felis, pulvinar a semper sed, adipiscing id dolor.
Pellentesque auctor nisi id magna consequat sagittis. Curabitur dapibus enim
sit amet elit pharetra tincidunt feugiat nisl imperdiet. Ut convallis libero in
urna ultrices accumsan. Donec sed odio eros. Donec viverra mi quis quam
pulvinar at malesuada arcu rhoncus. Cum sociis natoque penatibus et magnis dis
parturient montes, nascetur ridiculus mus. In rutrum accumsan ultricies. Mauris
vitae nisi at sem facilisis semper ac in est."""
str2 = """
Suspendisse lectus leo, consectetur in tempor sit amet, placerat quis neque.
Etiam luctus porttitor lorem, sed suscipit est rutrum non. Curabitur lobortis
nisl a enim congue semper. Aenean commodo ultrices imperdiet. Vestibulum ut
justo vel sapien venenatis tincidunt. Phasellus eget dolor sit amet ipsum
dapibus condimentum vitae quis lectus. Aliquam ut massa in turpis dapibus
convallis. Praesent elit lacus, vestibulum at malesuada et, ornare et est. Ut
augue nunc, sodales ut euismod non, adipiscing vitae orci. Mauris ut placerat
justo. Mauris in ultricies enim. Quisque nec est eleifend nulla ultrices
egestas quis ut quam. Donec sollicitudin lectus a mauris pulvinar id aliquam
urna cursus. Cras quis ligula sem, vel elementum mi. Phasellus non ullamcorper
urna."""
assert_equal(str1, str2)
5 ответов
у меня была такая же проблема в Python 3 (от чтения других ответов здесь) и использования im_class
не работает. Следующий фрагмент работает в Python 3 (см. как найти экземпляр связанного метода в Python?):
assert_equal.__self__.maxDiff = None
как прокомментировал @Louis, функции удобства are связанные методы на Dummy
экземпляра. Все они, похоже, находятся в одном экземпляре, поэтому меняя это, например,assert_equal
изменится на assert_dict_equal
и так далее. От Python docs, __self__
доступно с Python 2.6 и вперед.
установить maxDiff
to None
.
но вам придется действительно использовать unittest.TestCase
для ваших тестов, чтобы это сработало.Это shold работа.
class MyTest(unittest.TestCase):
maxDiff = None
def test_diff(self):
<your test here>
это работает в Python 2.7:
from unittest import TestCase
TestCase.maxDiff = None
он установит maxDiff по умолчанию для всех экземпляров TestCase, включая тот, к которому прикреплены assert_equals и друзья.
здесь у вас есть это (что google сказал мне):
# http://pdf2djvu.googlecode.com/hg/tests/common.py
try:
from nose.tools import assert_multi_line_equal
except ImportError:
assert_multi_line_equal = assert_equal
else:
assert_multi_line_equal.im_class.maxDiff = None
в python 2.7.3, nose 1.3.0, для меня работает следующее:
assert_equal.im_class.maxDiff = None
assert_equal(huge_thing, other_huge_thing)